{"text_format":"1","workbook":"xlsx","n_sheets":3,"sheets":["Character Record","Skills","Set Values"],"not_rendered":{"charts":0,"images":2,"macros":1,"external_links":0,"defined_names":39,"comments":1,"pivot_tables":0},"unopened":[],"bounds":{"document_bytes":16777216,"sheet_cells":100000,"rows_first":2000,"rows_last":500,"rows_between":2000,"halvings":0,"cell_chars":16384,"cell_head_chars":4096},"cells_cut":0,"cells_raw":0,"read":"whole","date_system":"1900"}

{"sheet":"Character Record","index":0,"n_rows":191,"n_cols":22,"rows_kept":191,"cut":false,"hidden":false,"merged":[[67,6,67,7],[65,6,65,7],[64,6,64,7],[29,1,29,2],[27,1,27,2],[34,3,34,7],[33,3,33,7],[32,3,32,7],[31,3,31,7],[34,0,34,2],[33,0,33,2],[32,0,32,2],[31,0,31,2],[0,0,0,5],[14,0,14,1],[14,2,14,5],[19,2,19,5],[28,1,28,2],[157,3,157,6],[158,3,158,6],[159,3,159,6],[160,3,160,6],[66,6,66,7],[153,3,153,6],[154,3,154,6],[155,3,155,6],[156,3,156,6],[152,3,152,6],[151,3,151,6],[148,3,148,6],[149,3,149,6],[150,3,150,6],[69,6,69,7],[68,6,68,7],[170,3,170,6],[171,3,171,6],[172,3,172,6],[173,3,173,6],[161,3,161,6],[162,3,162,6],[163,3,163,6],[164,3,164,6],[165,3,165,6],[166,3,166,6],[167,3,167,6],[168,3,168,6],[169,3,169,6],[180,5,180,7],[183,0,183,1],[177,0,177,1],[178,0,178,1],[179,0,179,1],[180,0,180,1],[181,0,181,1],[183,3,183,4],[181,5,181,7],[182,5,182,7],[183,5,183,7],[180,3,180,4],[181,3,181,4],[174,3,174,6],[175,3,175,6],[177,5,177,7],[178,5,178,7],[179,5,179,7],[177,3,177,4],[178,3,178,4],[179,3,179,4],[185,3,185,4],[184,5,184,7],[182,0,182,1],[182,3,182,4],[184,0,184,1],[184,3,184,4],[71,9,71,14],[189,5,189,7],[191,0,191,7],[185,5,185,7],[186,5,186,7],[187,5,187,7],[188,5,188,7],[186,3,186,4],[187,3,187,4],[188,3,188,4],[189,3,189,4],[189,0,189,1],[187,0,187,1],[188,0,188,1],[186,0,186,1],[185,0,185,1]]}
["Powers and Perils Character Record",null,null,null,null,null,"Name:"]
["Total Mult (2D6+14):",null,"Used:","HeightCalc",null,null,null,null,null,null,null,null,null,"Native Ability Modifiers"]
[24,null,{"$f":"SUM(C5:C12)","v":0},{"$f":"VLOOKUP((CONCATENATE(G3,H3)),'Set Values'!A18:B25,2,FALSE)+B5+B6","v":45},null,null,"Elf","Male",null,null,null,null,null,null,"Human",null,"Elf",null,"Faerry",null,"Dwarf"]
["Characteristic","Native Ability","Multiplier","Current Ability","Maximum Ability","Effective Ability","Bonuses",null,"Temp Bonuses","Temporary Mods",null,null,null,"Characteristic","Male","Female","Male","Female","Male","Female","Male","Female"]
["Strength (S)",null,null,null,{"$f":"ROUND(B5*C5,0)","v":0},{"$f":"D5+J5","v":0},"SB",{"$f":"VLOOKUP(CurStrength,'Set Values'!$A$2:$B$16,2,TRUE)","v":-1},{"$f":"VLOOKUP(EffectiveStrength,'Set Values'!$A$2:$B$16,2,TRUE)","v":-1},null,"S",null,null,"Strength",3,-1,-2,-3,-4,-6,1,0]
["Stamina (St)",null,null,null,{"$f":"ROUND(B6*C6,0)","v":0},{"$f":"D6+J6","v":0},"StB",{"$f":"VLOOKUP(CurStamina,'Set Values'!$A$2:$B$16,2,TRUE)","v":-1},{"$f":"VLOOKUP(EffectiveStamina,'Set Values'!$A$2:$B$16,2,TRUE)","v":-1},null,"St",null,null,"Stamina",0,1,-3,-2,-2,-3,2,2]
["Dexterity (D)",null,null,null,0,0,"DB",{"$f":"VLOOKUP(CurDexterity,'Set Values'!$A$2:$B$16,2,TRUE)","v":-1},{"$f":"VLOOKUP(EffectiveDexterity,'Set Values'!$A$2:$B$16,2,TRUE)","v":-1},null,"D",null,null,"Dexterity",-1,0,1,2,2,3,-1,-2]
["Agility (A)",null,null,null,0,0,"AB",{"$f":"VLOOKUP(CurAgility,'Set Values'!$A$2:$B$16,2,TRUE)","v":-1},{"$f":"VLOOKUP(EffectiveAgility,'Set Values'!$A$2:$B$16,2,TRUE)","v":-1},null,"A",null,null,"Agility",-1,1,2,2,3,3,-2,-1]
["Intelligence (I)",null,null,null,0,0,"CB",{"$f":"VLOOKUP(Constitution,'Set Values'!$A$2:$B$16,2,TRUE)","v":-1},{"$f":"VLOOKUP(EffectiveConstitution,'Set Values'!$A$2:$B$16,2,TRUE)","v":-1},null,"I",null,null,"Intelligence",2,0,3,2,4,2,0,0]
["Will (W)",null,null,null,0,0,"HPV",{"$f":"ROUNDUP(((EffectiveStrength+EffectiveStamina+EffectiveConstitution)/4),0)","v":0},null,null,"W",null,null,"Will",0,2,0,2,1,3,2,1]
["Eloquence (E)",null,null,null,0,0,"Damage",null,null,null,"E",null,null,"Eloquence",0,0,3,2,2,2,-2,-2]
["Empathy (Em)",null,null,null,0,0,"CE Pts",null,null,null,"Em",null,null,"Empathy",-3,-1,0,1,1,2,-1,0]
["Constitution (C)",null,null,{"$f":"ROUND(B13*C13,0)","v":0},{"$f":"Constitution","v":0},0,"CEL",{"$f":"VLOOKUP(H12,'Set Values'!C2:D32,2,TRUE)","v":0},null,null,"C",null,null,"Constitution",0,1,-1,-1,-2,-2,1,2]
["Appearance (A)",null,null,{"$f":"ROUND(B14*C14,0)","v":0},{"$f":"Appearance","v":0},0,"OCV",{"$f":"CEL+TempSB+TempStB+ROUNDDOWN(IF(ISNUMBER(VLOOKUP(\"Assassin\",$A$106:$B$126,2,FALSE)),VLOOKUP(\"Assassin\",$A$106:$B$126,2,FALSE))/3,0)","v":0},null,null,"Ap",null,null,"Appearance",0,0,1,2,2,4,-1,-2]
["Magic Factors",null,"Misc Factors",null,null,null,"DCV",{"$f":"CEL+TempAB+TempDB","v":-2},null,null,"MDV"]
["Mana Level",{"$f":"ROUNDUP(((CurIntelligence+CurWill+CurEmpathy)/10),0)","v":0},"Age",null,"Influence",{"$f":"EffectiveEloquence+EffectiveEmpathy+J16+IF(ISNUMBER(VLOOKUP(\"Rhetoric\",A106:B126,2,FALSE)),VLOOKUP(\"Rhetoric\",A106:B126,2,FALSE),0)","v":3},"Move Rate",{"$f":"MAX(VLOOKUP(Race,'Set Values'!A27:B30,2,FALSE)+1+TempAB+J17-IF(ISNUMBER(D19),IF(D19>250.9,1+ROUNDDOWN((D19-251)/50,0)),0),6)","v":10},null,null,"Influence Chance"]
["Magic Def Val. (MDV)",{"$f":"B16+IF(ISNUMBER(MEL),ROUNDUP(B23/2,0),0)+J15","v":0},"Station",null,"Portage",{"$f":"IF(TempStB>0,(2*EffectiveStrength+20*TempStB),(2*EffectiveStrength))","v":0},"Healing Chance",{"$f":"ROUNDUP((EffectiveConstitution+EffectiveStamina)/2,0)","v":0},null,null,"MR"]
["Energy Level",{"$f":"EffectiveConstitution+EffectiveWill","v":0},"Height",{"$f":"CONCATENATE(ROUNDDOWN(D3/12,0),\"' \",(MOD(D3,12)),\"\"\"\")","v":"3' 9\""},"Food Req",{"$f":"IF(ISNUMBER(D19),IF(D19<100,0.5,IF(D19<126,1,IF(D19<161,2,IF(D19<211,3,4+IF(D19>250,ROUNDUP((D19-250)/30,0)))))),0)","v":0.5},"Damage Tolerance Val",{"$f":"(ROUNDUP((EffectiveConstitution/20+TempStB),0))*-1","v":1}]
["Current En Lev",null,"Weight",{"$f":"IF(ISNUMBER(H26),(VLOOKUP((CONCATENATE(G3,H3)),'Set Values'!A18:B25,2,FALSE)+B5+B6)*H26,\"\")","v":85.5},"Poison Res",{"$f":"(TempCB+TempStB)*2","v":-4},"Dodge Value",{"$f":"TempAB+TempDB","v":-2}]
["Magic Path",null,"Money in Pocket",null,null,null,"Phase MR"]
["Orientation",null,"GC",null,"CC",null,"1)",{"$f":"ROUNDDOWN($H$16/4,0)+IF(MOD($H$16,4)>0,1,0)","v":3}]
["Mag Exp Pts",null,"SC",null,"BB",null,"2)",{"$f":"ROUNDDOWN($H$16/4,0)+IF(MOD($H$16,4)>2,1,0)","v":2}]
["MEL",{"$f":"IF(ISBLANK(B20),\"\",VLOOKUP(B22,'Set Values'!E2:F32,2,TRUE))","v":""},"Other Wealth:",null,null,null,"3)",{"$f":"ROUNDDOWN($H$16/4,0)+IF(MOD($H$16,4)>1,1,0)","v":3}]
["Casting Ability",null,null,null,null,null,"4)",{"$f":"ROUNDDOWN($H$16/4,0)","v":2}]
["Mana Pts Used",null,null,null,null,null,"Flying MR",{"$f":"IF(Race=\"Faerry\",27+1+DB,\"\")","v":""}]
["Mana Regen.",{"$f":"IF(ISBLANK(B20),\"\",ROUNDUP(D10/10,0)+ROUNDDOWN(B23/5,0))","v":""},null,null,null,null,"Weight Factor",1.9]
["Armors:",null,null,"EL","AV","DR","Damage","DR+EL"]
["Body:","Plate Armor",null,null,5,45]
["Head:","Full Metal",null,null,6,{"$f":"10*E29","v":60}]
["Shield:","Metal",null,{"$f":"IF(ISNUMBER(VLOOKUP(\"Shield\",$A$128:$B$148,2,FALSE)),VLOOKUP(\"Shield\",$A$128:$B$148,2,FALSE),\"\")","v":11},null,19,null,{"$f":"F30-G30+D30","v":30}]
["Character and Equipment Special atts:"]
[]
[]
[]
[]
["Weapons (HtoH & Thrown):","EL (eff)","WSB","FV","Normal","Severe","Deadly","Fatigue Damage"]
["Hand-to-Hand",{"$f":"IF(ISBLANK(A37),\"\",VLOOKUP(A37,$A$128:$H$148,2,FALSE)+ROUNDUP(IF(ISNUMBER(VLOOKUP(\"Assassin\",$A$106:$B$126,2,FALSE)),VLOOKUP(\"Assassin\",$A$106:$B$126,2,FALSE))/3,0))","v":9},0,null,{"$f":"CONCATENATE(\"1D3+(\",IF(B37<>\"\",TempSB,ROUNDDOWN(TempSB/2,0)),\")\")","v":"1D3+(-1)"},{"$f":"CONCATENATE(\"1D6+(\",IF(B37<>\"\",H5+ROUNDUP(B37/2,0),H5),\")\")","v":"1D6+(4)"},{"$f":"CONCATENATE(IF(H5>1,1+H5,2),\"D10\",IF(B37<>\"\",CONCATENATE(\"+(\",B37,\")\"),\"\"))","v":"2D10+(9)"}]
[null,{"$f":"IF(ISBLANK(A38),\"\",VLOOKUP(A38,$A$128:$H$148,2,FALSE)+ROUNDUP(IF(ISNUMBER(VLOOKUP(\"Assassin\",$A$106:$B$126,2,FALSE)),VLOOKUP(\"Assassin\",$A$106:$B$126,2,FALSE))/3,0))","v":""},5,36,{"$f":"IF(ISBLANK(A38),\"\",CONCATENATE(\"1D6+(\",TempSB+C38,\")\"))","v":""},{"$f":"IF(ISBLANK(A38),\"\",CONCATENATE(\"1D10+(\",TempSB+C38+ROUNDUP(B38/2,0),\")\"))","v":""},{"$f":"IF(ISBLANK(A38),\"\",CONCATENATE(IF(TempSB>1,1+TempSB,2),\"D10+(\",C38+B38,\")\"))","v":""}]
["Light Lance",6,-1,7,{"$f":"IF(ISBLANK(A39),\"\",CONCATENATE(\"1D6+(\",TempSB+C39,\")\"))","v":"1D6+(-2)"},{"$f":"IF(ISBLANK(A39),\"\",CONCATENATE(\"1D10+(\",TempSB+C39+ROUNDUP(B39/2,0),\")\"))","v":"1D10+(1)"},{"$f":"IF(ISBLANK(A39),\"\",CONCATENATE(IF(TempSB>1,1+TempSB,2),\"D10+(\",C39+B39,\")\"))","v":"2D10+(5)"}]
["Light Lance",{"$f":"IF(ISBLANK(A40),\"\",VLOOKUP(A40,$A$128:$H$148,2,FALSE)+ROUNDUP(IF(ISNUMBER(VLOOKUP(\"Assassin\",$A$106:$B$126,2,FALSE)),VLOOKUP(\"Assassin\",$A$106:$B$126,2,FALSE))/3,0)+B48)","v":11},1,7,{"$f":"CONCATENATE(\"1D6+(\",TempSB+C40+C48,\")\")","v":"1D6+(2)"},{"$f":"CONCATENATE(\"1D10+(\",TempSB+C40+C48+ROUNDUP((B40+B48)/2,0),\")\")","v":"1D10+(10)"},{"$f":"CONCATENATE(IF(TempSB>1,1+TempSB,2),\"D10+(\",C40+B40+B48+C48,\")\")","v":"2D10+(19)"},null,"Charge"]
[null,{"$f":"IF(ISBLANK(A41),\"\",VLOOKUP(A41,$A$128:$H$148,2,FALSE)+ROUNDUP(IF(ISNUMBER(VLOOKUP(\"Assassin\",$A$106:$B$126,2,FALSE)),VLOOKUP(\"Assassin\",$A$106:$B$126,2,FALSE))/3,0))","v":""},0,6,{"$f":"IF(ISBLANK(A41),\"\",CONCATENATE(\"1D6+(\",TempSB+C41,\")\"))","v":""},{"$f":"IF(ISBLANK(A41),\"\",CONCATENATE(\"1D10+(\",TempSB+C41+ROUNDUP(B41/2,0),\")\"))","v":""},{"$f":"IF(ISBLANK(A41),\"\",CONCATENATE(IF(TempSB>1,1+TempSB,2),\"D10+(\",C41+B41,\")\"))","v":""},1]
[null,"",1,12,"","","",5]
[null,"",null,null,"","",""]
[null,"",null,null,"","",""]
[null,"",null,null,"","",""]
[null,"",null,null,"","",""]
["Horse Archery",{"$f":"IF(ISBLANK(A47),\"\",VLOOKUP(A47,$A$128:$H$148,2,FALSE))","v":3},null,null,null,null,null,null,"EL is subtracted from moving mount mod, the max bow EL from horseback is the lesser of this, or bow EL."]
["Horsemanship",5,2,null,null,null,null,null,"Note that the EL here also affects other weapons from horseback"]
["Ranged Weapons"]
[null,{"$f":"IF(ISBLANK(A50),\"\",VLOOKUP(A50,$A$128:$H$148,2,FALSE)+ROUNDUP(IF(ISNUMBER(VLOOKUP(\"Assassin\",$A$106:$B$126,2,FALSE)),VLOOKUP(\"Assassin\",$A$106:$B$126,2,FALSE))/3,0))","v":""},null,6,{"$f":"IF(ISBLANK(A50),\"\",CONCATENATE(\"1D6+(\",C50,\")\"))","v":""},{"$f":"IF(ISBLANK(A50),\"\",CONCATENATE(\"1D10+(\",C50+ROUNDUP(B50/2,0),\")\"))","v":""},{"$f":"IF(ISBLANK(A50),\"\",CONCATENATE(2,\"D10+(\",C50+B50,\")\"))","v":""},null,"FV is for arrows"]
[null,{"$f":"IF(ISBLANK(A51),\"\",VLOOKUP(A51,$A$128:$H$148,2,FALSE)+ROUNDUP(IF(ISNUMBER(VLOOKUP(\"Assassin\",$A$106:$B$126,2,FALSE)),VLOOKUP(\"Assassin\",$A$106:$B$126,2,FALSE))/3,0))","v":""},null,null,{"$f":"IF(ISBLANK(A51),\"\",CONCATENATE(\"1D6+(\",C51,\")\"))","v":""},{"$f":"IF(ISBLANK(A51),\"\",CONCATENATE(\"1D10+(\",C51+ROUNDUP(B51/2,0),\")\"))","v":""},{"$f":"IF(ISBLANK(A51),\"\",CONCATENATE(2,\"D10+(\",C51+B51,\")\"))","v":""}]
[null,"",null,null,{"$f":"IF(ISBLANK(A52),\"\",CONCATENATE(\"1D6+(\",C52,\")\"))","v":""},{"$f":"IF(ISBLANK(A52),\"\",CONCATENATE(\"1D10+(\",C52+ROUNDUP(B52/2,0),\")\"))","v":""},{"$f":"IF(ISBLANK(A52),\"\",CONCATENATE(2,\"D10+(\",C52+B52,\")\"))","v":""}]
[null,"",null,null,"","",""]
[null,"",null,null,"","",""]
[null,"",null,null,{"$f":"IF(ISBLANK(A55),\"\",CONCATENATE(\"1D6+(\",C55,\")\"))","v":""},{"$f":"IF(ISBLANK(A55),\"\",CONCATENATE(\"1D10+(\",C55+ROUNDUP(B55/2,0),\")\"))","v":""},{"$f":"IF(ISBLANK(A55),\"\",CONCATENATE(2,\"D10+(\",C55+B55,\")\"))","v":""}]
[null,"",null,null,{"$f":"IF(ISBLANK(A56),\"\",CONCATENATE(\"1D6+(\",C56,\")\"))","v":""},{"$f":"IF(ISBLANK(A56),\"\",CONCATENATE(\"1D10+(\",C56+ROUNDUP(B56/2,0),\")\"))","v":""},{"$f":"IF(ISBLANK(A56),\"\",CONCATENATE(2,\"D10+(\",C56+B56,\")\"))","v":""}]
["Ranged Weapons","Base Range","Point Blank","Short","Medium","Long","Extended","Ext?"]
[null,{"$f":"IF(ISBLANK(A58),\"\",VLOOKUP($A58,RangedWeapons,7,FALSE))","v":""},{"$f":"IF(ISBLANK(A58),\"\",ROUNDDOWN(B58/10,0))","v":""},{"$f":"IF(ISBLANK(A58),\"\",CONCATENATE((C58+1),\"-\",(ROUNDDOWN(B58/4,0))))","v":""},{"$f":"IF(ISBLANK(A58),\"\",CONCATENATE((ROUNDDOWN(B58/4,0)+1),\"-\",ROUNDUP(B58/2,0)))","v":""},{"$f":"IF(ISBLANK(A58),\"\",CONCATENATE((ROUNDUP(B58/2,)),\"-\",B58))","v":""},{"$f":"IF(ISBLANK(A58),\"\",IF(H58=\"Y\",CONCATENATE(B58+1,\"-\",B58*2),\"\"))","v":""},{"$f":"IF(ISBLANK(A58),\"\",VLOOKUP($A58,RangedWeapons,6,FALSE))","v":""}]
[null,"",{"$f":"IF(ISBLANK(A59),\"\",ROUNDDOWN(B59/10,0))","v":""},{"$f":"IF(ISBLANK(A59),\"\",CONCATENATE((C59+1),\"-\",(ROUNDDOWN(B59/4,0))))","v":""},{"$f":"IF(ISBLANK(A59),\"\",CONCATENATE((ROUNDDOWN(B59/4,0)+1),\"-\",ROUNDUP(B59/2,0)))","v":""},{"$f":"IF(ISBLANK(A59),\"\",CONCATENATE((ROUNDUP(B59/2,)),\"-\",B59))","v":""},{"$f":"IF(ISBLANK(A59),\"\",IF(H59=\"Y\",CONCATENATE(B59+1,\"-\",B59*2),\"\"))","v":""},""]
[null,"","","","","","",""]
{"$rows_left_out":132}
{"sheet":"Skills","index":1,"n_rows":118,"n_cols":8,"rows_kept":118,"cut":false,"hidden":false,"merged":[]}
["Skill","Cost to Learn","EL Increase","Max Level","Notes"]
["Normal Knowledge skills"]
["Acrobat",40,"NEL*NEL","(D + A + E) / 15"]
["Architect",150,8,"(I + W + Em) / 2 or 80"]
["Armorer",100,9,"I + W + StB * 5 or 80","Weapon and armor smithing, but not bows or arrows"]
["Artist",60,5,"( W + D + Em) / 2 or 80","Must choose a media type to specialize in (painting, sculture, drawing, etc.)"]
["Assassin",200,"NEL*15","(I + W + D + A) / 20","-EL to all combat rolls, -EL*2 to ambush attempts, -EL*3 to trailing or hiding, OCV+EL/3 RD, +EL/3 RU to all combat EL's, Ambush damage: Deadly (SB+1)D10+ EL*2 + normal mods, Severe 2D10+EL+normal, Normal 1D10+EL/2+normal"]
["Badlander",50,10,"A + Em + StB * 5 or 80","Finding way/water/trails in unfamiliar/hostile terrain, add EL/5ru to desert or badlands survival for ambush or avoidance of, and searching. Can also roll against EL to detect before an ambush is sprung, success = can react and warn others, partial success=is alert but cannot warn. Chance to wake up is increased by a multiple in all cases. Includes: Tracking at max EL, knows basic badlands creatures, knows legends nearest his home, 40% chance of knowing Dwarf Elder (if so, is a Dwarf friend), 10% chance of EL=Em in Elf Sidh (if so, is a friend of Searbhani), starting EL in both sling forms, 60% chance of max EL Fighting Dagger, Max EL in Badlands Survival.",null,null,"Must choose Open Waterways, or Swamp. Can judge currents and distances travelled, Memorises landmarks and watercourses like a thief on EL rolls (success=100% accuracy, partial = 75%, failure = 50%), Open Waterway Boatman: knows creatures in open waterways, max EL Waterway Survival, starting EL Warstaff, 40% chance of max EL in sling. Swamp Boatman: Max EL in Swamp Survival, knowledge of swamp creatures, starting EL Bow, 40% chance of max EL Warstaff."]
["Blacksmith",10,5,"S + W or 80","Note that this does not include weapon and armor making other than items that also serve as tools"]
["Boatman",40,9,"S + A + StB * 5 or 80","Must choose Open Waterways, or Swamp. Can judge currents and distances travelled, Memorises landmarks and watercourses like a thief on EL rolls (success=100% accuracy, partial = 75%, failure = 50%), Open Waterway Boatman: knows creatures in open waterways, max EL Waterway Survival, starting EL Warstaff, 40% chance of max EL in sling. Swamp Boatman: Max EL in Swamp Survival, knowledge of swamp creatures, starting EL Bow, 40% chance of max EL Warstaff."]
["Bowyer",45,7,"(I + W + D) / 2 or 80","Bow making"]
["Brewer",10,3,"I + Em or 80"]
["Carpenter",10,5,"W + D + StB * 5"]
["Carrying",10,2,"(S + St) / 2"]
["Climbing",25,"NEL*NEL","(S + A) / 10 + StB","There is only one climbing skill, I am assuming this includes 'scaling' (urban climbing)"]
["Clothier",10,4,"(W + D + Em) / 2 or 80"]
["Deftness",15,3,"W + D or 80","(look this one up)"]
["Disguise Artist",30,5,"(I + Em + D) / 2 or 80"]
["Entertainer:"]
["Actor",40,"NEL*NEL","(I + E + Em) / 15"]
["Dancer",40,"NEL*NEL","(A + Em + Ap) / 15"]
["Musician",40,"NEL*NEL","(D + Em)/10"]
["Singer",40,"NEL*NEL","(W + E + Em) / 15"]
["Eroticist",70,"NEL*NEL","(W + Em + A + Ap) / 20"]
["Executioner",30,"NEL*NEL","(S + W + E) / 15"]
["Fletcher",10,4,"W + D or 80","Arrow or bolt making"]
["Forester",35,8,"S + A + StB * 5 or 80"]
["Gambler",60,"NEL*5","(W + D + E + Em) / 20"]
["Healer",120,20,"(I + Em) / 10"]
["Herbalist",80,7,"I + Em or 80"]
["Hillman",40,9,"S + A + StB * 5 or 80","Can judge heights and distances, can memorize landmarks like a thief, judge current position relative to past or goal on EL (on success can either retrace steps or plot best route to goal, success = 100% accuracy, partial=75%, failure=50%), knowledge of Hill creatures, starting EL climbing, 40% chance of EL=Em Elf Sidh & starting EL Forest Survival (if so is an Elf friend), starting EL Throwing Spear, max EL Hill Survival, 40% chance of players choice of max EL Sword OR Hand-to-Hand."]
["Husbandry",30,8,"W + Em or 80","Choose animal"]
["Jeweler",100,10,"W + D or 80"]
["Language (unrelated)",30,3,60,"Includes languages of other races"]
["Language (related)",20,2,80,"Language within family of native language of character"]
["Locksmith",25,7,"W + D or 80"]
["Mason",10,5,"S + St or 80"]
["Merchant",45,5,"W + E or 80"]
["Miner",30,6,"S + St or 80"]
["Moneylender",60,5,"(I + W + E) / 2 or 80"]
["Mountaineer",40,9,"S + A + StB * 5 or 80","Can judge heights and distances, can memorize landmarks like a thief, judge current position relative to past or goal on EL (on success can either retrace steps or plot best route to goal, success = 100% accuracy, partial=75%, failure=50%), knowledge of Mountain creatures, max EL climbing, 40% chance of EL=Em Dwarf Elder & starting EL Underground(both types) Survival (if so is an Dwarf friend), starting EL Throwing Spear, max EL Mountain Survival, 40% chance of max EL in any one form of Heavy Sword or Axe."]
["Navigation",80,12,"(I + W) / 2 + Em or 80","Waterborne navigation (other is covered under survival)"]
["Potter",10,4,"(W + D + Em) / 2 or 80"]
["Read+Write",45,3,"I + Em or 80","Double cost to learn without instruction"]
["Rhetoric",30,"NEL*NEL","(W + E + Em) / 15"]
["Scribe",30,4,"D + Em or 80"]
["Scrounger",20,15,"(I + Em) / 10 + StB","A form of the Survival skill with specific application: can find things in or near human habitations. Subtract EL for food (or any other) searching rolls, add ELx2 to Availability of items in markets. Is only available if also has City Survival, use at 1/2 EL in unfamiliar areas."]
["Scholar",100,6,"(I + W + Em) / 2 or 80","Must choose an area of knowledge to specialize in (i.e. Archeology, History of Northern Tribes, Written Languages, Mathematics)"]
["Seaman",25,5,"(S + St + A) / 2 or 80","Knows tasks of operating ocean-going craft, can fight from one without reduction (others reduce OCV/DCV/EL by 50%), can handle ocean hazards at EL, can sail inland waterways at 1/2 EL, can maintain and repair large vessels (roll against EL)."]
["Servant",10,3,"(St + I + Em) / 2 or 80"]
["Sign Language",15,2,"I + Em or 80"]
["Smuggler",120,8,"(D + W + E) / 2 or 80"]
["Supernatural Language",60,5,"(I + W + Em) / 3 or 60"]
["Survival",20,15,"(I + Em) / 10 + StB","Must choose an environment (ie desert), with separate tracking for each env (add Waterway, Ocean to list)"]
["Swimming",15,"NEL*5","(S + St) / 10 + AB"]
["Tanner",10,5,"St + W or 80"]
["Teamster",10,3,"St + W or 80","Handling animal teams"]
["Thief","75 (100)",10,"(I + D + A) / 2 or 80"]
["Tracking",20,"NEL*NEL","(W + Em) / 10","Following/finding in wilderness setting"]
["Trailing",15,4,"(I + Em + A) / 2 or 80","Following/finding in urban setting"]
{"$rows_left_out":59}
{"sheet":"Set Values","index":2,"n_rows":32,"n_cols":15,"rows_kept":32,"cut":false,"hidden":false,"merged":[]}
["Ability","Bonus","C Exp Pts","CEL","M Exp Pts","MEL","Ranged Weapons:","PointBlnk","Short","Med","Long","Ext","BaseRng","Alignment"]
[0,-1,0,0,0,0,"Arbalest",15,8,-2,-12,"Y",24,"Law","Learn & EL inc.: Elder & Balance 2x, Chaos 4x Casting Cost: Elder & Balance +1/EL, Chaos 2x"]
[6,0,40,1,20,1,"Bolas",10,-1,-13,-20,"N",{"$f":"4+ROUNDDOWN(TempSB/2,0)","v":4},"Balance","Learn: Balance 0.5x, Elder 1x, Law & Chaos 3x EL inc.: Balance & Elder 1x, Law and Chaos 3x Casting Cost: Elder 1x, Law & Chaos 3x"]
[16,1,100,2,40,2,"Bow",11,4,-6,-18,"Y",20,"Chaos","Learn & El inc.: Elder & Balance 2x, Law 3x Casting Cost: Elder & Balance +1/EL, Law 2x"]
[31,2,250,3,80,3,"Composite Bow",14,7,-3,-14,"Y",25,"Sidh","Learn: Elder 2x EL inc.: Elder 1x Casting Cost: Elder 1x"]
[51,3,450,4,150,4,"Handle Sling",3,9,-4,-17,"Y",{"$f":"18+ROUNDDOWN(TempSB/2,0)","v":18},"Shadow","Special costs for other magic: see guide"]
[76,4,750,5,300,5,"Heavy Crossbow",12,6,-3,-16,"Y",20]
[106,5,1200,6,600,6,"Javelin",6,0,-9,-20,"N",{"$f":"6+TempSB","v":5}]
[141,6,2000,7,1200,7,"Light Crossbow",9,5,-6,-20,"Y",18]
[181,7,3000,8,2400,8,"Light Lance",8,-2,-10,-20,"N",{"$f":"3+ROUNDDOWN(TempSB/2,0)","v":3}]
[226,8,4200,9,4000,9,"Longbow",12,8,0,-10,"Y",30]
[276,9,5500,10,6000,10,"Other Dagger",5,-3,-15,-20,"N",{"$f":"4+ROUNDDOWN(TempSB/2,0)","v":4}]
[331,10,7000,11,9000,11,"Other Thrown",4,-4,-14,-20,"N",{"$f":"4+TempSB","v":3}]
[396,11,9000,12,13000,12,"Repeating Crossbow",7,1,-8,-18,"N",16]
[466,12,12000,13,18000,13,"Sling",4,6,-6,-19,"Y",{"$f":"12+ROUNDDOWN(TempSB/2,0)","v":12}]
[551,13,16000,14,24000,14,"Spear",5,-1,-7,-16,"N",{"$f":"8+TempSB","v":7}]
["Height mods",null,22000,15,32000,15,"Throwing Axe",6,-2,-10,-20,"N",{"$f":"5+TempSB","v":4}]
["HumanMale",46,30000,16,42000,16,"Throwing Dagger",8,0,-12,-20,"N",{"$f":"5+ROUNDDOWN(TempSB/2,0)","v":5}]
["HumanFemale",42,40000,17,54000,17]
["ElfMale",45,52000,18,68000,18]
["ElfFemale",42,66000,19,84000,19]
["FaerryMale",28,82000,20,100000,20]
["FaerryFemale",28,102000,21,116000,21]
["DwarfMale",35,122000,22,132000,22]
["DwarfFemale",32,142000,23,148000,23]
["Base Move rates",null,162000,24,164000,24]
["Human",9,182000,25,180000,25]
["Elf",10,202000,26,196000,26]
["Faerry",6,222000,27,212000,27]
["Dwarf",8,242000,28,228000,28]
[null,null,262000,29,244000,29]
[null,null,282000,30,260000,30]